Reaction Details
TargetMelanin-concentrating hormone receptor 1
LigandBDBM50169394
Substrate/Competitorn/a
Meas. Tech.ChEMBL_303523 (CHEMBL839637)
Ki 13±n/a nM
Citation Guo, TShao, YQian, GRokosz, LLStauffer, TMHunter, RCBabu, SDGu, HHobbs, DW Discovery and SAR of biaryl piperidine MCH1 receptor antagonists through solid-phase encoded combinatorial synthesis. Bioorg Med Chem Lett15:3696-700 (2005) 
 
Melanin-concentrating hormone receptor 1
Name:Melanin-concentrating hormone receptor 1
Type:G Protein-Coupled Receptor (GPCR)
Mol. Mass.:45976.27
Organism:Homo sapiens (Human)
Description:Membranes from CHO-K1 cells stably expressing human MCH1R were used in assays.
Residue:422
BDBM50169394
NameBDBM50169394
Synonyms:1-[1-sec-Butyl-4-(3'-cyano-biphenyl-4-yl)-piperidin-4-ylmethyl]-3-(3,5-dichloro-phenyl)-urea | CHEMBL179275
TypeSmall organic molecule
Emp. Form.C30H32Cl2N4O
Mol. Mass.535.507
SMILESCCC(C)N1CCC(CNC(=O)Nc2cc(Cl)cc(Cl)c2)(CC1)c1ccc(cc1)-c1cccc(c1)C#N