Reaction Details
TargetMelanin-concentrating hormone receptor 1
LigandBDBM50169396
Substrate/Competitorn/a
Meas. Tech.ChEMBL_303523 (CHEMBL839637)
Ki 1.4±n/a nM
Citation Guo, TShao, YQian, GRokosz, LLStauffer, TMHunter, RCBabu, SDGu, HHobbs, DW Discovery and SAR of biaryl piperidine MCH1 receptor antagonists through solid-phase encoded combinatorial synthesis. Bioorg Med Chem Lett15:3696-700 (2005) 
 
Melanin-concentrating hormone receptor 1
Name:Melanin-concentrating hormone receptor 1
Type:G Protein-Coupled Receptor (GPCR)
Mol. Mass.:45976.27
Organism:Homo sapiens (Human)
Description:Membranes from CHO-K1 cells stably expressing human MCH1R were used in assays.
Residue:422
BDBM50169396
NameBDBM50169396
Synonyms:1-[4-(3'-Cyano-biphenyl-4-yl)-1-methyl-piperidin-4-ylmethyl]-3-(3,4-difluoro-phenyl)-urea | CHEMBL368888
TypeSmall organic molecule
Emp. Form.C27H26F2N4O
Mol. Mass.460.5183
SMILESCN1CCC(CNC(=O)Nc2ccc(F)c(F)c2)(CC1)c1ccc(cc1)-c1cccc(c1)C#N