Reaction Details
TargetMethionine aminopeptidase 1
LigandBDBM50169671
Substrate/Competitorn/a
Meas. Tech.ChEMBL_311969 (CHEMBL834386)
IC50 220±n/a nM
Citation Cui, YMHuang, QQXu, JChen, LLLi, JYYe, QZLi, JNan, FJ Identification of potent type I MetAP inhibitors by simple bioisosteric replacement. Part 1: Synthesis and preliminary SAR studies of thiazole-4-carboxylic acid thiazol-2-ylamide derivatives. Bioorg Med Chem Lett15:3732-6 (2005) 
 
Methionine aminopeptidase 1
Name:Methionine aminopeptidase 1
Type:PROTEIN
Mol. Mass.:43382.92
Organism:Saccharomyces cerevisiae
Description:ChEMBL_10701
Residue:387
BDBM50169671
NameBDBM50169671
Synonyms:5-Propionylamino-thiazole-4-carboxylic acid thiazol-2-ylamide | CHEMBL361618
TypeSmall organic molecule
Emp. Form.C10H10N4O2S2
Mol. Mass.282.342
SMILESCCC(=O)Nc1scnc1C(=O)Nc1nccs1