Reaction Details
TargetAcidic phospholipase A2 EC-I
LigandBDBM50148911
Substrate/Competitorn/a
Meas. Tech.ChEMBL_305580 (CHEMBL828028)
IC50 2300±n/a nM
Citation Khanum, SAMurari, SKVishwanth, BSShashikanth, S Synthesis of benzoyl phenyl benzoates as effective inhibitors for phospholipase A2 and hyaluronidase enzymes. Bioorg Med Chem Lett15:4100-4 (2005) 
 
Acidic phospholipase A2 EC-I
Name:Acidic phospholipase A2 EC-I
Type:PROTEIN
Mol. Mass.:15520.08
Organism:Echis carinatus
Description:ChEMBL_305580
Residue:136
BDBM50148911
NameBDBM50148911
Synonyms:(3beta)-3-hydroxyurs-12-en-28-oic acid CHEMBL169 malol urson
TypeSmall organic molecule
Emp. Form.C30H48O3
Mol. Mass.456.7003
SMILESC[C@@H]1CC[C@@]2(CC[C@]3(C)C(=CC[C@@H]4[C@@]5(C)CC[C@H](O)C(C)(C)[C@@H]5CC[C@@]34C)[C@@H]2[C@H]1C)C(O)=O