Reaction Details
TargetB1 bradykinin receptor
LigandBDBM50169823
Substrate/Competitorn/a
Meas. Tech.ChEMBL_302466 (CHEMBL826332)
Ki 7.00±n/a nM
Citation Kuduk, SDChang, RKNg, CMurphy, KLRansom, RWTang, CPrueksaritanont, TFreidinger, RMPettibone, DJBock, MG Bradykinin B1 antagonists: SAR studies in the 2,3-diaminopyridine series. Bioorg Med Chem Lett15:3925-9 (2005) 
 
B1 bradykinin receptor
Name:B1 bradykinin receptor
Type:Enzyme
Mol. Mass.:40508.87
Organism:Homo sapiens (Human)
Description:P46663
Residue:353
BDBM50169823
NameBDBM50169823
Synonyms:(+)-6-(4-{[3-(2-Cyano-acetylamino)-4-methyl-pyridin-2-ylamino]-methyl}-phenyl)-cyclohex-3-enecarboxylic acid methyl ester (+/-trans)-6-(4-{[3-(2-Cyano-acetylamino)-4-methyl-pyridin-2-ylamino]-methyl}-phenyl)-cyclohex-3-enecarboxylic acid methyl ester CHEMBL182378
TypeSmall organic molecule
Emp. Form.C24H26N4O3
Mol. Mass.418.4882
SMILESCOC(=O)C1CC=CCC1c1ccc(CNc2nccc(C)c2NC(=O)CC#N)cc1