Reaction Details
Target5-hydroxytryptamine receptor 2C
LigandBDBM50169840
Substrate/Competitorn/a
Meas. Tech.ChEMBL_302364 (CHEMBL828083)
Ki 14±n/a nM
Citation Fish, LRGilligan, MTHumphries, ACIvarsson, MLadduwahetty, TMerchant, KJO'Connor, DPatel, SPhilipps, EVargas, HMHutson, PHMacLeod, AM 4-Fluorosulfonylpiperidines: selective 5-HT2A ligands for the treatment of insomnia. Bioorg Med Chem Lett15:3665-9 (2005) 
 
5-hydroxytryptamine receptor 2C
Name:5-hydroxytryptamine receptor 2C
Type:G Protein-Coupled Receptor (GPCR)
Mol. Mass.:51836.79
Organism:Homo sapiens (Human)
Description:P28335
Residue:458
BDBM50169840
NameBDBM50169840
Synonyms:1-[2-(2,4-Difluoro-phenyl)-ethyl]-4-fluoro-4-(2-fluoro-benzenesulfonyl)-piperidine | CHEMBL177416
TypeSmall organic molecule
Emp. Form.C19H19F4NO2S
Mol. Mass.401.418
SMILESFc1ccc(CCN2CCC(F)(CC2)S(=O)(=O)c2ccccc2F)c(F)c1