Reaction Details
Target5-hydroxytryptamine receptor 2A
LigandBDBM50108690
Substrate/Competitorn/a
Meas. Tech.ChEMBL_302363 (CHEMBL828082)
Ki 0.33±n/a nM
Citation Fish, LRGilligan, MTHumphries, ACIvarsson, MLadduwahetty, TMerchant, KJO'Connor, DPatel, SPhilipps, EVargas, HMHutson, PHMacLeod, AM 4-Fluorosulfonylpiperidines: selective 5-HT2A ligands for the treatment of insomnia. Bioorg Med Chem Lett15:3665-9 (2005) 
 
5-hydroxytryptamine receptor 2A
Name:5-hydroxytryptamine receptor 2A
Type:undefined
Mol. Mass.:52607.65
Organism:Homo sapiens (Human)
Description:P28223
Residue:471
BDBM50108690
NameBDBM50108690
Synonyms:1-(2,4-difluorophenethyl)-4-(phenylsulfonyl)piperidine CHEMBL145939
TypeSmall organic molecule
Emp. Form.C19H21F2NO2S
Mol. Mass.365.437
SMILESFc1ccc(CCN2CCC(CC2)S(=O)(=O)c2ccccc2)c(F)c1