Reaction Details
TargetD(2) dopamine receptor
LigandBDBM50169842
Substrate/Competitorn/a
Meas. Tech.ChEMBL_302285 (CHEMBL830303)
Ki 313±n/a nM
Citation Fish, LRGilligan, MTHumphries, ACIvarsson, MLadduwahetty, TMerchant, KJO'Connor, DPatel, SPhilipps, EVargas, HMHutson, PHMacLeod, AM 4-Fluorosulfonylpiperidines: selective 5-HT2A ligands for the treatment of insomnia. Bioorg Med Chem Lett15:3665-9 (2005) 
 
D(2) dopamine receptor
Name:D(2) dopamine receptor
Type:Cell-surface receptors
Mol. Mass.:50647.10
Organism:Homo sapiens (Human)
Description:P14416
Residue:443
BDBM50169842
NameBDBM50169842
Synonyms:1-(2,4-difluorophenethyl)-4-fluoro-4-(4-fluorophenylsulfonyl)piperidine CHEMBL175832
TypeSmall organic molecule
Emp. Form.C19H19F4NO2S
Mol. Mass.401.418
SMILESFc1ccc(cc1)S(=O)(=O)C1(F)CCN(CCc2ccc(F)cc2F)CC1