Reaction Details
TargetD(2) dopamine receptor
LigandBDBM50169839
Substrate/Competitorn/a
Meas. Tech.ChEMBL_302285 (CHEMBL830303)
Ki 863.0±n/a nM
Citation Fish, LRGilligan, MTHumphries, ACIvarsson, MLadduwahetty, TMerchant, KJO'Connor, DPatel, SPhilipps, EVargas, HMHutson, PHMacLeod, AM 4-Fluorosulfonylpiperidines: selective 5-HT2A ligands for the treatment of insomnia. Bioorg Med Chem Lett15:3665-9 (2005) 
 
D(2) dopamine receptor
Name:D(2) dopamine receptor
Type:Cell-surface receptors
Mol. Mass.:50647.10
Organism:Homo sapiens (Human)
Description:P14416
Residue:443
BDBM50169839
NameBDBM50169839
Synonyms:4-{1-[2-(2,4-Difluoro-phenyl)-ethyl]-4-fluoro-piperidine-4-sulfonyl}-benzonitrile | CHEMBL368816
TypeSmall organic molecule
Emp. Form.C20H19F3N2O2S
Mol. Mass.408.437
SMILESFc1ccc(CCN2CCC(F)(CC2)S(=O)(=O)c2ccc(cc2)C#N)c(F)c1