Reaction Details
TargetD(2) dopamine receptor
LigandBDBM50108690
Substrate/Competitorn/a
Meas. Tech.ChEMBL_302285 (CHEMBL830303)
Ki>1500±n/a nM
Citation Fish, LRGilligan, MTHumphries, ACIvarsson, MLadduwahetty, TMerchant, KJO'Connor, DPatel, SPhilipps, EVargas, HMHutson, PHMacLeod, AM 4-Fluorosulfonylpiperidines: selective 5-HT2A ligands for the treatment of insomnia. Bioorg Med Chem Lett15:3665-9 (2005) 
 
D(2) dopamine receptor
Name:D(2) dopamine receptor
Type:Cell-surface receptors
Mol. Mass.:50647.10
Organism:Homo sapiens (Human)
Description:P14416
Residue:443
BDBM50108690
NameBDBM50108690
Synonyms:1-(2,4-difluorophenethyl)-4-(phenylsulfonyl)piperidine CHEMBL145939
TypeSmall organic molecule
Emp. Form.C19H21F2NO2S
Mol. Mass.365.437
SMILESFc1ccc(CCN2CCC(CC2)S(=O)(=O)c2ccccc2)c(F)c1