Reaction Details
Target5-hydroxytryptamine receptor 2A
LigandBDBM50169844
Substrate/Competitorn/a
Meas. Tech.ChEMBL_302363 (CHEMBL828082)
Ki 0.66±n/a nM
Citation Fish, LRGilligan, MTHumphries, ACIvarsson, MLadduwahetty, TMerchant, KJO'Connor, DPatel, SPhilipps, EVargas, HMHutson, PHMacLeod, AM 4-Fluorosulfonylpiperidines: selective 5-HT2A ligands for the treatment of insomnia. Bioorg Med Chem Lett15:3665-9 (2005) 
 
5-hydroxytryptamine receptor 2A
Name:5-hydroxytryptamine receptor 2A
Type:undefined
Mol. Mass.:52607.65
Organism:Homo sapiens (Human)
Description:P28223
Residue:471
BDBM50169844
NameBDBM50169844
Synonyms:1-[2-(2,4-Difluoro-phenyl)-ethyl]-4-fluoro-4-(4-[1,2,3]triazol-1-yl-benzenesulfonyl)-piperidine | CHEMBL174049
TypeSmall organic molecule
Emp. Form.C21H21F3N4O2S
Mol. Mass.450.477
SMILESFc1ccc(CCN2CCC(F)(CC2)S(=O)(=O)c2ccc(cc2)-n2ccnn2)c(F)c1