Reaction Details
Target5-hydroxytryptamine receptor 2C
LigandBDBM50169846
Substrate/Competitorn/a
Meas. Tech.ChEMBL_302364 (CHEMBL828083)
Ki 130±n/a nM
Citation Fish, LRGilligan, MTHumphries, ACIvarsson, MLadduwahetty, TMerchant, KJO'Connor, DPatel, SPhilipps, EVargas, HMHutson, PHMacLeod, AM 4-Fluorosulfonylpiperidines: selective 5-HT2A ligands for the treatment of insomnia. Bioorg Med Chem Lett15:3665-9 (2005) 
 
5-hydroxytryptamine receptor 2C
Name:5-hydroxytryptamine receptor 2C
Type:G Protein-Coupled Receptor (GPCR)
Mol. Mass.:51836.79
Organism:Homo sapiens (Human)
Description:P28335
Residue:458
BDBM50169846
NameBDBM50169846
Synonyms:2-(4-Benzenesulfonyl-piperidin-1-yl)-1-(2,4-difluoro-phenyl)-ethanone | CHEMBL177807
TypeSmall organic molecule
Emp. Form.C19H19F2NO3S
Mol. Mass.379.421
SMILESFc1ccc(C(=O)CN2CCC(CC2)S(=O)(=O)c2ccccc2)c(F)c1