Reaction Details
TargetPotassium voltage-gated channel subfamily H member 2
LigandBDBM50108699
Substrate/Competitorn/a
Meas. Tech.ChEMBL_302272 (CHEMBL875187)
Ki 710±n/a nM
Citation Fish, LRGilligan, MTHumphries, ACIvarsson, MLadduwahetty, TMerchant, KJO'Connor, DPatel, SPhilipps, EVargas, HMHutson, PHMacLeod, AM 4-Fluorosulfonylpiperidines: selective 5-HT2A ligands for the treatment of insomnia. Bioorg Med Chem Lett15:3665-9 (2005) 
 
Potassium voltage-gated channel subfamily H member 2
Name:Potassium voltage-gated channel subfamily H member 2
Type:Multi-pass membrane protein
Mol. Mass.:126672.65
Organism:Homo sapiens (Human)
Description:Q12809
Residue:1159
BDBM50108699
NameBDBM50108699
Synonyms:1-(2,4-difluorophenethyl)-4-(4-fluorophenylsulfonyl)piperidine 1-[2-(2,4-Difluoro-phenyl)-ethyl]-4-(4-fluoro-benzenesulfonyl)-piperidine | CHEMBL358075
TypeSmall organic molecule
Emp. Form.C19H20F3NO2S
Mol. Mass.383.428
SMILESFc1ccc(cc1)S(=O)(=O)C1CCN(CCc2ccc(F)cc2F)CC1