Reaction Details
TargetVascular endothelial growth factor receptor 2
LigandBDBM50169893
Substrate/Competitorn/a
Meas. Tech.ChEMBL_305535 (CHEMBL828555)
IC50 5030±n/a nM
Citation Kuo, GHDeangelis, AEmanuel, SWang, AZhang, YConnolly, PJChen, XGruninger, RHRugg, CFuentes-Pesquera, AMiddleton, SAJolliffe, LMurray, WV Synthesis and identification of [1,3,5]triazine-pyridine biheteroaryl as a novel series of potent cyclin-dependent kinase inhibitors. J Med Chem48:4535-46 (2005) 
 
Vascular endothelial growth factor receptor 2
Name:Vascular endothelial growth factor receptor 2
Type:Receptor Tyrosine Kinase
Mol. Mass.:151510.97
Organism:Homo sapiens (Human)
Description:P35968
Residue:1356
BDBM50169893
NameBDBM50169893
Synonyms:3-{5-[4-(4-Morpholin-4-yl-phenylamino)-[1,3,5]triazin-2-yl]-pyridin-3-ylamino}-propan-1-ol | CHEMBL191377
TypeSmall organic molecule
Emp. Form.C21H25N7O2
Mol. Mass.407.4689
SMILESOCCCNc1cncc(c1)-c1ncnc(Nc2ccc(cc2)N2CCOCC2)n1