Reaction Details
TargetVascular endothelial growth factor receptor 2
LigandBDBM50169894
Substrate/Competitorn/a
Meas. Tech.ChEMBL_305535 (CHEMBL828555)
IC50>10000±n/a nM
Citation Kuo, GHDeangelis, AEmanuel, SWang, AZhang, YConnolly, PJChen, XGruninger, RHRugg, CFuentes-Pesquera, AMiddleton, SAJolliffe, LMurray, WV Synthesis and identification of [1,3,5]triazine-pyridine biheteroaryl as a novel series of potent cyclin-dependent kinase inhibitors. J Med Chem48:4535-46 (2005) 
 
Vascular endothelial growth factor receptor 2
Name:Vascular endothelial growth factor receptor 2
Type:Receptor Tyrosine Kinase
Mol. Mass.:151510.97
Organism:Homo sapiens (Human)
Description:P35968
Residue:1356
BDBM50169894
NameBDBM50169894
Synonyms:3-{6-[4-(3-Chloro-phenylamino)-[1,3,5]triazin-2-yl]-pyrazin-2-ylamino}-propan-1-ol | CHEMBL193029
TypeSmall organic molecule
Emp. Form.C16H16ClN7O
Mol. Mass.357.798
SMILESOCCCNc1cncc(n1)-c1ncnc(Nc2cccc(Cl)c2)n1