Reaction Details
TargetCyclin-dependent kinase 1
LigandBDBM50169897
Substrate/Competitorn/a
Meas. Tech.ChEMBL_305069 (CHEMBL832701)
IC50 1108±n/a nM
Citation Kuo, GHDeangelis, AEmanuel, SWang, AZhang, YConnolly, PJChen, XGruninger, RHRugg, CFuentes-Pesquera, AMiddleton, SAJolliffe, LMurray, WV Synthesis and identification of [1,3,5]triazine-pyridine biheteroaryl as a novel series of potent cyclin-dependent kinase inhibitors. J Med Chem48:4535-46 (2005) 
 
Cyclin-dependent kinase 1
Name:Cyclin-dependent kinase 1
Type:Enzyme Subunit
Mol. Mass.:34101.08
Organism:Homo sapiens (Human)
Description:P06493
Residue:297
BDBM50169897
NameBDBM50169897
Synonyms:3-{4-[4-Amino-6-(3-chloro-phenylamino)-[1,3,5]triazin-2-yl]-pyridin-2-ylamino}-propan-1-ol | CHEMBL190805
TypeSmall organic molecule
Emp. Form.C17H18ClN7O
Mol. Mass.371.824
SMILESNc1nc(Nc2cccc(Cl)c2)nc(n1)-c1ccnc(NCCCO)c1