Reaction Details
TargetCyclin-dependent kinase 1/G2/mitotic-specific cyclin-B1/G2/mitotic-specific cyclin-B2/G2/mitotic-specific cyclin-B3/cAMP-dependent protein kinase
LigandBDBM50169892
Substrate/Competitorn/a
Meas. Tech.ChEMBL_305209 (CHEMBL832462)
IC50>10000±n/a nM
Citation Kuo, GHDeangelis, AEmanuel, SWang, AZhang, YConnolly, PJChen, XGruninger, RHRugg, CFuentes-Pesquera, AMiddleton, SAJolliffe, LMurray, WV Synthesis and identification of [1,3,5]triazine-pyridine biheteroaryl as a novel series of potent cyclin-dependent kinase inhibitors. J Med Chem48:4535-46 (2005) 
 
Cyclin-dependent kinase 1/G2/mitotic-specific cyclin-B1/G2/mitotic-specific cyclin-B2/G2/mitotic-specific cyclin-B3/cAMP-dependent protein kinase
Name:Cyclin-dependent kinase 1/G2/mitotic-specific cyclin-B1/G2/mitotic-specific cyclin-B2/G2/mitotic-specific cyclin-B3/cAMP-dependent protein kinase
Synonyms:Cyclin B/Cyclin-Dependent Kinase 1 (CDK1)/G2/mitotic-specific cyclin B2/G2/mitotic-specific cyclin B3/cAMP-dependent protein kinase alpha-catalytic subunit
Type:n/a
Mol. Mass.:n/a
Description:ASSAY_ID of EBI is 305209
Components:This complex has 5 components.
Component 1
Name:G2/mitotic-specific cyclin-B3
Type:PROTEIN
Mol. Mass.:157916.84
Organism:Homo sapiens (Human)
Description:n/a
Residue:1395
Component 2
Name:G2/mitotic-specific cyclin-B1
Synonyms:CCNB CCNB1_HUMAN
Type:Enzyme Subunit
Mol. Mass.:48340.95
Organism:Homo sapiens (Human)
Description:P14635
Residue:433
Component 3
Name:G2/mitotic-specific cyclin-B2
Synonyms:CCNB2 Cyclin-dependent kinase 1/cyclin B | G2/mitotic-specific cyclin-B2
Type:PROTEIN
Mol. Mass.:45293.13
Organism:Homo sapiens (Human)
Description:n/a
Residue:398
Component 4
Name:Cyclin-dependent kinase 1
Synonyms:CDC2 CDK1 CDKN1 Cell division protein kinase 1 P34CDC2 | p34 protein kinase
Type:Enzyme Subunit
Mol. Mass.:34101.08
Organism:Homo sapiens (Human)
Description:P06493
Residue:297
Component 5
Name:cAMP-dependent protein kinase
Synonyms:Cyclic AMP-dependent protein kinase (PKA) Serine/threonine-protein kinase | cAMP-dependent protein kinase alpha-catalytic subunit
Type:Enzyme
Mol. Mass.:40766.33
Organism:Oryctolagus cuniculus (Rabbit)
Description:Q95J97
Residue:351
BDBM50169892
NameBDBM50169892
Synonyms:3-{4-[4-(3-Chloro-phenylamino)-[1,3,5]triazin-2-yl]-pyridin-2-ylamino}-propan-1-ol | CHEMBL191336
TypeSmall organic molecule
Emp. Form.C17H17ClN6O
Mol. Mass.356.809
SMILESOCCCNc1cc(ccn1)-c1ncnc(Nc2cccc(Cl)c2)n1