Reaction Details
TargetMitogen-activated protein kinase 1
LigandBDBM50169892
Substrate/Competitorn/a
Meas. Tech.ChEMBL_304592 (CHEMBL828482)
IC50>10000±n/a nM
Citation Kuo, GHDeangelis, AEmanuel, SWang, AZhang, YConnolly, PJChen, XGruninger, RHRugg, CFuentes-Pesquera, AMiddleton, SAJolliffe, LMurray, WV Synthesis and identification of [1,3,5]triazine-pyridine biheteroaryl as a novel series of potent cyclin-dependent kinase inhibitors. J Med Chem48:4535-46 (2005) 
 
Mitogen-activated protein kinase 1
Name:Mitogen-activated protein kinase 1
Type:Ser/Thr Protein Kinase
Mol. Mass.:41392.76
Organism:Homo sapiens (Human)
Description:P28482
Residue:360
BDBM50169892
NameBDBM50169892
Synonyms:3-{4-[4-(3-Chloro-phenylamino)-[1,3,5]triazin-2-yl]-pyridin-2-ylamino}-propan-1-ol | CHEMBL191336
TypeSmall organic molecule
Emp. Form.C17H17ClN6O
Mol. Mass.356.809
SMILESOCCCNc1cc(ccn1)-c1ncnc(Nc2cccc(Cl)c2)n1