Reaction Details
TargetRNA-directed RNA polymerase
LigandBDBM50162102
Substrate/Competitorn/a
Meas. Tech.ChEMBL_305448 (CHEMBL830123)
IC50 59±n/a nM
Citation Harper, SAvolio, SPacini, BDi Filippo, MAltamura, STomei, LPaonessa, GDi Marco, SCarfi, AGiuliano, CPadron, JBonelli, FMigliaccio, GDe Francesco, RLaufer, RRowley, MNarjes, F Potent inhibitors of subgenomic hepatitis C virus RNA replication through optimization of indole-N-acetamide allosteric inhibitors of the viral NS5B polymerase. J Med Chem48:4547-57 (2005) 
 
RNA-directed RNA polymerase
Name:RNA-directed RNA polymerase
Type:Protein
Mol. Mass.:25173.95
Organism:Hepatitis C virus
Description:Q8JXU8
Residue:229
BDBM50162102
NameBDBM50162102
Synonyms:3-Cyclohexyl-1-dimethylcarbamoylmethyl-2-phenyl-1H-indole-6-carboxylic acid CHEMBL178126
TypeSmall organic molecule
Emp. Form.C25H28N2O3
Mol. Mass.404.5014
SMILESCN(C)C(=O)Cn1c(c(C2CCCCC2)c2ccc(cc12)C(O)=O)-c1ccccc1