Reaction Details
TargetRNA-directed RNA polymerase
LigandBDBM50169931
Substrate/Competitorn/a
Meas. Tech.ChEMBL_305448 (CHEMBL830123)
IC50 12±n/a nM
Citation Harper, SAvolio, SPacini, BDi Filippo, MAltamura, STomei, LPaonessa, GDi Marco, SCarfi, AGiuliano, CPadron, JBonelli, FMigliaccio, GDe Francesco, RLaufer, RRowley, MNarjes, F Potent inhibitors of subgenomic hepatitis C virus RNA replication through optimization of indole-N-acetamide allosteric inhibitors of the viral NS5B polymerase. J Med Chem48:4547-57 (2005) 
 
RNA-directed RNA polymerase
Name:RNA-directed RNA polymerase
Type:Protein
Mol. Mass.:25173.95
Organism:Hepatitis C virus
Description:Q8JXU8
Residue:229
BDBM50169931
NameBDBM50169931
Synonyms:2-(4-Chloro-phenyl)-3-cyclohexyl-1-{[methyl-(1-methyl-piperidin-3-ylmethyl)-carbamoyl]-methyl}-1H-indole-6-carboxylic acid | CHEMBL372433
TypeSmall organic molecule
Emp. Form.C31H38ClN3O3
Mol. Mass.536.105
SMILESCN(CC1CCCN(C)C1)C(=O)Cn1c(c(C2CCCCC2)c2ccc(cc12)C(O)=O)-c1ccc(Cl)cc1