Reaction Details
TargetRNA-directed RNA polymerase
LigandBDBM50169922
Substrate/Competitorn/a
Meas. Tech.ChEMBL_305910 (CHEMBL832625)
IC50 9±n/a nM
Citation Harper, SAvolio, SPacini, BDi Filippo, MAltamura, STomei, LPaonessa, GDi Marco, SCarfi, AGiuliano, CPadron, JBonelli, FMigliaccio, GDe Francesco, RLaufer, RRowley, MNarjes, F Potent inhibitors of subgenomic hepatitis C virus RNA replication through optimization of indole-N-acetamide allosteric inhibitors of the viral NS5B polymerase. J Med Chem48:4547-57 (2005) 
 
RNA-directed RNA polymerase
Name:RNA-directed RNA polymerase
Type:Protein
Mol. Mass.:25173.95
Organism:Hepatitis C virus
Description:Q8JXU8
Residue:229
BDBM50169922
NameBDBM50169922
Synonyms:3-Cyclohexyl-1-[2-(4-diethylamino-piperidin-1-yl)-2-oxo-ethyl]-2-(4-methoxy-phenyl)-1H-indole-6-carboxylic acid | CHEMBL190098
TypeSmall organic molecule
Emp. Form.C33H43N3O4
Mol. Mass.545.7122
SMILESCCN(CC)C1CCN(CC1)C(=O)Cn1c(c(C2CCCCC2)c2ccc(cc12)C(O)=O)-c1ccc(OC)cc1