Reaction Details
TargetCannabinoid receptor 2
LigandBDBM50169952
Substrate/Competitorn/a
Meas. Tech.ChEMBL_303211 (CHEMBL829836)
Ki 8.9±n/a nM
Citation Lu, DMeng, ZThakur, GAFan, PSteed, JTartal, CLHurst, DPReggio, PHDeschamps, JRParrish, DAGeorge, CJärbe, TULamb, RJMakriyannis, A Adamantyl cannabinoids: a novel class of cannabinergic ligands. J Med Chem48:4576-85 (2005) 
 
Cannabinoid receptor 2
Name:Cannabinoid receptor 2
Type:Enzyme Catalytic Domain
Mol. Mass.:38220.43
Organism:MOUSE
Description:P47936
Residue:347
BDBM50169952
NameBDBM50169952
Synonyms:(6aR,10aR)-3-Adamantan-2-ylidenemethyl-6,6,9-trimethyl-6a,7,10,10a-tetrahydro-6H-benzo[c]chromen-1-ol CHEMBL191324
TypeSmall organic molecule
Emp. Form.C27H34O2
Mol. Mass.390.5577
SMILESCC1=CC[C@@H]2[C@@H](C1)c1c(O)cc(C=C3C4CC5CC(C4)CC3C5)cc1OC2(C)C