Reaction Details
TargetCannabinoid receptor 1
LigandBDBM50169951
Substrate/Competitorn/a
Meas. Tech.ChEMBL_302959 (CHEMBL828804)
Ki 6.8±n/a nM
Citation Lu, DMeng, ZThakur, GAFan, PSteed, JTartal, CLHurst, DPReggio, PHDeschamps, JRParrish, DAGeorge, CJärbe, TULamb, RJMakriyannis, A Adamantyl cannabinoids: a novel class of cannabinergic ligands. J Med Chem48:4576-85 (2005) 
 
Cannabinoid receptor 1
Name:Cannabinoid receptor 1
Type:G Protein-Coupled Receptor (GPCR)
Mol. Mass.:52856.55
Organism:Rattus norvegicus (rat)
Description:P20272
Residue:473
BDBM50169951
NameBDBM50169951
Synonyms:(6aR,10aR)-3-Adamantan-1-yl-6,6,9-trimethyl-6a,7,10,10a-tetrahydro-6H-benzo[c]chromen-1-ol AM-411 | CHEMBL434351
TypeSmall organic molecule
Emp. Form.C26H34O2
Mol. Mass.378.547
SMILESCC1=CC[C@@H]2[C@@H](C1)c1c(O)cc(cc1OC2(C)C)C12CC3CC(CC(C3)C1)C2