Reaction Details
TargetAdenosine receptor A3
LigandBDBM50170132
Substrate/Competitorn/a
Meas. Tech.ChEMBL_303662 (CHEMBL830423)
Ki 0.8±n/a nM
Citation Baraldi, PGPreti, DTabrizi, MAFruttarolo, FRomagnoli, RZaid, NAMoorman, ARMerighi, SVarani, KBorea, PA New pyrrolo[2,1-f]purine-2,4-dione and imidazo[2,1-f]purine-2,4-dione derivatives as potent and selective human A3 adenosine receptor antagonists. J Med Chem48:4697-701 (2005) 
 
Adenosine receptor A3
Name:Adenosine receptor A3
Type:G Protein-Coupled Receptor (GPCR)
Mol. Mass.:36197.32
Organism:Homo sapiens (Human)
Description:P0DMS8
Residue:318
BDBM50170132
NameBDBM50170132
Synonyms:1-Benzyl-7-methyl-3-propyl-1H,8H-imidazo[2,1-f]purine-2,4-dione | CHEMBL434534
TypeSmall organic molecule
Emp. Form.C18H19N5O2
Mol. Mass.337.3758
SMILESCCCn1c(=O)n(Cc2ccccc2)c2nc3[nH]c(C)cn3c2c1=O