Reaction Details
TargetNeuronal acetylcholine receptor subunit alpha-7
LigandBDBM50099562
Substrate/Competitorn/a
Meas. Tech.ChEMBL_304161 (CHEMBL877116)
EC50 44000±n/a nM
Citation Papke, RLZheng, GHorenstein, NADwoskin, LPCrooks, PA The characterization of a novel rigid nicotine analog with alpha7-selective nAChR agonist activity and modulation of agonist properties by boron inclusion. Bioorg Med Chem Lett15:3874-80 (2005) 
 
Neuronal acetylcholine receptor subunit alpha-7
Name:Neuronal acetylcholine receptor subunit alpha-7
Type:Enzyme
Mol. Mass.:56502.44
Organism:Rattus norvegicus (Rat)
Description:Q05941
Residue:502
BDBM50099562
NameBDBM50099562
Synonyms:(3aS,9bR)-1-Methyl-2,3,3a,4,5,9b-hexahydro-1H-pyrrolo[3,2-h]isoquinoline | CHEMBL417278
TypeSmall organic molecule
Emp. Form.C12H16N2
Mol. Mass.188.2688
SMILESCN1CC[C@@H]2CCc3ccncc3[C@H]12