Reaction Details
TargetMatrix metalloproteinase-14
LigandBDBM50170291
Substrate/Competitorn/a
Meas. Tech.ChEMBL_304646 (CHEMBL828529)
IC50 10900±n/a nM
Citation Wu, JRush, TSHotchandani, RDu, XGeck, MCollins, EXu, ZBSkotnicki, JLevin, JILovering, FE Identification of potent and selective MMP-13 inhibitors. Bioorg Med Chem Lett15:4105-9 (2005) 
 
Matrix metalloproteinase-14
Name:Matrix metalloproteinase-14
Type:Protein
Mol. Mass.:65900.19
Organism:Homo sapiens (Human)
Description:P50281
Residue:582
BDBM50170291
NameBDBM50170291
Synonyms:(S)-2-{4'-[(7-Methoxy-benzofuran-2-carbonyl)-amino]-biphenyl-4-sulfonylamino}-3-methyl-butyric acid | CHEMBL364185
TypeSmall organic molecule
Emp. Form.C27H26N2O7S
Mol. Mass.522.57
SMILESCOc1cccc2cc(oc12)C(=O)Nc1ccc(cc1)-c1ccc(cc1)S(=O)(=O)N[C@@H](C(C)C)C(O)=O