Reaction Details
TargetMatrix metalloproteinase-14
LigandBDBM50170290
Substrate/Competitorn/a
Meas. Tech.ChEMBL_304646 (CHEMBL828529)
IC50 13900±n/a nM
Citation Wu, JRush, TSHotchandani, RDu, XGeck, MCollins, EXu, ZBSkotnicki, JLevin, JILovering, FE Identification of potent and selective MMP-13 inhibitors. Bioorg Med Chem Lett15:4105-9 (2005) 
 
Matrix metalloproteinase-14
Name:Matrix metalloproteinase-14
Type:Protein
Mol. Mass.:65900.19
Organism:Homo sapiens (Human)
Description:P50281
Residue:582
BDBM50170290
NameBDBM50170290
Synonyms:CHEMBL189955 | {4'-[(Benzofuran-2-carbonyl)-amino]-biphenyl-4-sulfonylamino}-acetic acid
TypeSmall organic molecule
Emp. Form.C23H18N2O6S
Mol. Mass.450.464
SMILESOC(=O)CNS(=O)(=O)c1ccc(cc1)-c1ccc(NC(=O)c2cc3ccccc3o2)cc1