Reaction Details
TargetCollagenase 3
LigandBDBM50170289
Substrate/Competitorn/a
Meas. Tech.ChEMBL_305658 (CHEMBL829516)
IC50 2.2±n/a nM
Citation Wu, JRush, TSHotchandani, RDu, XGeck, MCollins, EXu, ZBSkotnicki, JLevin, JILovering, FE Identification of potent and selective MMP-13 inhibitors. Bioorg Med Chem Lett15:4105-9 (2005) 
 
Collagenase 3
Name:Collagenase 3
Type:PROTEIN
Mol. Mass.:53910.47
Organism:Bos taurus
Description:ChEMBL_305658
Residue:471
BDBM50170289
NameBDBM50170289
Synonyms:(S)-2-{4'-[(Benzofuran-2-carbonyl)-amino]-biphenyl-4-sulfonylamino}-4-methyl-pentanoic acid | CHEMBL439668
TypeSmall organic molecule
Emp. Form.C27H26N2O6S
Mol. Mass.506.57
SMILESCC(C)C[C@H](NS(=O)(=O)c1ccc(cc1)-c1ccc(NC(=O)c2cc3ccccc3o2)cc1)C(O)=O