Reaction Details
Target72 kDa type IV collagenase
LigandBDBM50170293
Substrate/Competitorn/a
Meas. Tech.ChEMBL_304620 (CHEMBL828506)
IC50 1590±n/a nM
Citation Wu, JRush, TSHotchandani, RDu, XGeck, MCollins, EXu, ZBSkotnicki, JLevin, JILovering, FE Identification of potent and selective MMP-13 inhibitors. Bioorg Med Chem Lett15:4105-9 (2005) 
 
72 kDa type IV collagenase
Name:72 kDa type IV collagenase
Type:Enzyme
Mol. Mass.:73870.36
Organism:Homo sapiens (Human)
Description: P08253
Residue:660
BDBM50170293
NameBDBM50170293
Synonyms:(S)-2-(4'-{[4-(1-Carboxy-ethoxy)-benzofuran-2-carbonyl]-amino}-biphenyl-4-sulfonylamino)-3-methyl-butyric acid | CHEMBL191106
TypeSmall organic molecule
Emp. Form.C29H28N2O9S
Mol. Mass.580.606
SMILESCC(C)[C@H](NS(=O)(=O)c1ccc(cc1)-c1ccc(NC(=O)c2cc3c(OC(C)C(O)=O)cccc3o2)cc1)C(O)=O