Reaction Details
TargetMetabotropic glutamate receptor 2
LigandBDBM50170308
Substrate/Competitorn/a
Meas. Tech.ChEMBL_304368 (CHEMBL829010)
EC50 3591±n/a nM
Citation Govek, SPBonnefous, CHutchinson, JHKamenecka, TMcQuiston, JPracitto, RZhao, LXGardner, MFJames, JKDaggett, LPRowe, BASchaffhauser, HBristow, LJCampbell, UCRodriguez, DEVernier, JM Benzazoles as allosteric potentiators of metabotropic glutamate receptor 2 (mGluR2): efficacy in an animal model for schizophrenia. Bioorg Med Chem Lett15:4068-72 (2005) 
 
Metabotropic glutamate receptor 2
Name:Metabotropic glutamate receptor 2
Type:Enzyme
Mol. Mass.:95584.88
Organism:Homo sapiens (Human)
Description:Q14416
Residue:872
BDBM50170308
NameBDBM50170308
Synonyms:1-(2,2-Dimethyl-propyl)-5-{4-[4-(1H-tetrazol-5-yl)-phenoxy]-butoxy}-1H-indole | CHEMBL187342
TypeSmall organic molecule
Emp. Form.C24H29N5O2
Mol. Mass.419.5194
SMILESCC(C)(C)Cn1ccc2cc(OCCCCOc3ccc(cc3)-c3nnn[nH]3)ccc12