Reaction Details
TargetMetabotropic glutamate receptor 2
LigandBDBM50170309
Substrate/Competitorn/a
Meas. Tech.ChEMBL_304368 (CHEMBL829010)
EC50 134±n/a nM
Citation Govek, SPBonnefous, CHutchinson, JHKamenecka, TMcQuiston, JPracitto, RZhao, LXGardner, MFJames, JKDaggett, LPRowe, BASchaffhauser, HBristow, LJCampbell, UCRodriguez, DEVernier, JM Benzazoles as allosteric potentiators of metabotropic glutamate receptor 2 (mGluR2): efficacy in an animal model for schizophrenia. Bioorg Med Chem Lett15:4068-72 (2005) 
 
Metabotropic glutamate receptor 2
Name:Metabotropic glutamate receptor 2
Type:Enzyme
Mol. Mass.:95584.88
Organism:Homo sapiens (Human)
Description:Q14416
Residue:872
BDBM50170309
NameBDBM50170309
Synonyms:1-(2,2-Dimethyl-propyl)-4-propyl-5-[3-(1H-tetrazol-5-yl)-phenoxy]-1H-indole | CHEMBL363945
TypeSmall organic molecule
Emp. Form.C23H27N5O
Mol. Mass.389.4934
SMILESCCCc1c(Oc2cccc(c2)-c2nnn[nH]2)ccc2n(CC(C)(C)C)ccc12