Reaction Details
TargetMetabotropic glutamate receptor 2
LigandBDBM50170312
Substrate/Competitorn/a
Meas. Tech.ChEMBL_304412 (CHEMBL831817)
EC50 936.0±n/a nM
Citation Govek, SPBonnefous, CHutchinson, JHKamenecka, TMcQuiston, JPracitto, RZhao, LXGardner, MFJames, JKDaggett, LPRowe, BASchaffhauser, HBristow, LJCampbell, UCRodriguez, DEVernier, JM Benzazoles as allosteric potentiators of metabotropic glutamate receptor 2 (mGluR2): efficacy in an animal model for schizophrenia. Bioorg Med Chem Lett15:4068-72 (2005) 
 
Metabotropic glutamate receptor 2
Name:Metabotropic glutamate receptor 2
Type:Enzyme
Mol. Mass.:95584.88
Organism:Homo sapiens (Human)
Description:Q14416
Residue:872
BDBM50170312
NameBDBM50170312
Synonyms:1-(2,2-Dimethyl-propyl)-4-propyl-5-{4-[4-(1H-tetrazol-5-yl)-phenoxy]-butoxy}-1H-benzotriazole | CHEMBL424998
TypeSmall organic molecule
Emp. Form.C25H33N7O2
Mol. Mass.463.5752
SMILESCCCc1c(OCCCCOc2ccc(cc2)-c2nnn[nH]2)ccc2n(CC(C)(C)C)nnc12