Reaction Details
TargetMetabotropic glutamate receptor 2
LigandBDBM50170325
Substrate/Competitorn/a
Meas. Tech.ChEMBL_304368 (CHEMBL829010)
EC50 755±n/a nM
Citation Govek, SPBonnefous, CHutchinson, JHKamenecka, TMcQuiston, JPracitto, RZhao, LXGardner, MFJames, JKDaggett, LPRowe, BASchaffhauser, HBristow, LJCampbell, UCRodriguez, DEVernier, JM Benzazoles as allosteric potentiators of metabotropic glutamate receptor 2 (mGluR2): efficacy in an animal model for schizophrenia. Bioorg Med Chem Lett15:4068-72 (2005) 
 
Metabotropic glutamate receptor 2
Name:Metabotropic glutamate receptor 2
Type:Enzyme
Mol. Mass.:95584.88
Organism:Homo sapiens (Human)
Description:Q14416
Residue:872
BDBM50170325
NameBDBM50170325
Synonyms:1-Cyclopropylmethyl-4-propyl-5-{4-[4-(1H-tetrazol-5-yl)-phenoxy]-butoxy}-1H-indole | CHEMBL363531
TypeSmall organic molecule
Emp. Form.C26H31N5O2
Mol. Mass.445.5566
SMILESCCCc1c(OCCCCOc2ccc(cc2)-c2nnn[nH]2)ccc2n(CC3CC3)ccc12