Reaction Details
TargetCannabinoid receptor 1
LigandBDBM50170331
Substrate/Competitorn/a
Meas. Tech.ChEMBL_302852 (CHEMBL828768)
Ki 23±n/a nM
Citation Huffman, JWSzklennik, PVAlmond, ABushell, KSelley, DEHe, HCassidy, MPWiley, JLMartin, BR 1-Pentyl-3-phenylacetylindoles, a new class of cannabimimetic indoles. Bioorg Med Chem Lett15:4110-3 (2005) 
 
Cannabinoid receptor 1
Name:Cannabinoid receptor 1
Type:G Protein-Coupled Receptor (GPCR)
Mol. Mass.:52856.55
Organism:Rattus norvegicus (rat)
Description:P20272
Residue:473
BDBM50170331
NameBDBM50170331
Synonyms:2-(2-Fluoro-phenyl)-1-(1-pentyl-1H-indol-3-yl)-ethanone CHEMBL187883 | JWH-311
TypeSmall organic molecule
Emp. Form.C21H22FNO
Mol. Mass.323.4039
SMILESCCCCCn1cc(C(=O)Cc2ccccc2F)c2ccccc12