Reaction Details
TargetCannabinoid receptor 2
LigandBDBM50170338
Substrate/Competitorn/a
Meas. Tech.ChEMBL_302853 (CHEMBL828769)
Ki 159±n/a nM
Citation Huffman, JWSzklennik, PVAlmond, ABushell, KSelley, DEHe, HCassidy, MPWiley, JLMartin, BR 1-Pentyl-3-phenylacetylindoles, a new class of cannabimimetic indoles. Bioorg Med Chem Lett15:4110-3 (2005) 
 
Cannabinoid receptor 2
Name:Cannabinoid receptor 2
Type:G Protein-Coupled Receptor (GPCR)
Mol. Mass.:39690.94
Organism:Homo sapiens (Human)
Description:P34972
Residue:360
BDBM50170338
NameBDBM50170338
Synonyms:1-(1-Pentyl-1H-indol-3-yl)-2-phenyl-ethanone CHEMBL365878 | JWH-167
TypeSmall organic molecule
Emp. Form.C21H23NO
Mol. Mass.305.4134
SMILESCCCCCn1cc(C(=O)Cc2ccccc2)c2ccccc12