Reaction Details
TargetCannabinoid receptor 1
LigandBDBM50170351
Substrate/Competitorn/a
Meas. Tech.ChEMBL_302852 (CHEMBL828768)
Ki 179±n/a nM
Citation Huffman, JWSzklennik, PVAlmond, ABushell, KSelley, DEHe, HCassidy, MPWiley, JLMartin, BR 1-Pentyl-3-phenylacetylindoles, a new class of cannabimimetic indoles. Bioorg Med Chem Lett15:4110-3 (2005) 
 
Cannabinoid receptor 1
Name:Cannabinoid receptor 1
Type:G Protein-Coupled Receptor (GPCR)
Mol. Mass.:52856.55
Organism:Rattus norvegicus (rat)
Description:P20272
Residue:473
BDBM50170351
NameBDBM50170351
Synonyms:1-(1-Pentyl-1H-indol-3-yl)-2-p-tolyl-ethanone CHEMBL187354 | JWH-208
TypeSmall organic molecule
Emp. Form.C22H25NO
Mol. Mass.319.44
SMILESCCCCCn1cc(C(=O)Cc2ccc(C)cc2)c2ccccc12