Reaction Details
TargetCannabinoid receptor 2
LigandBDBM50170357
Substrate/Competitorn/a
Meas. Tech.ChEMBL_302853 (CHEMBL828769)
Ki 7±n/a nM
Citation Huffman, JWSzklennik, PVAlmond, ABushell, KSelley, DEHe, HCassidy, MPWiley, JLMartin, BR 1-Pentyl-3-phenylacetylindoles, a new class of cannabimimetic indoles. Bioorg Med Chem Lett15:4110-3 (2005) 
 
Cannabinoid receptor 2
Name:Cannabinoid receptor 2
Type:G Protein-Coupled Receptor (GPCR)
Mol. Mass.:39690.94
Organism:Homo sapiens (Human)
Description:P34972
Residue:360
BDBM50170357
NameBDBM50170357
Synonyms:2-(2-Chloro-phenyl)-1-(1-pentyl-1H-indol-3-yl)-ethanone CHEMBL189035 | JWH-203
TypeSmall organic molecule
Emp. Form.C21H22ClNO
Mol. Mass.339.858
SMILESCCCCCn1cc(C(=O)Cc2ccccc2Cl)c2ccccc12