Reaction Details
TargetCannabinoid receptor 1
LigandBDBM50170357
Substrate/Competitorn/a
Meas. Tech.ChEMBL_302852 (CHEMBL828768)
Ki 8±n/a nM
Citation Huffman, JWSzklennik, PVAlmond, ABushell, KSelley, DEHe, HCassidy, MPWiley, JLMartin, BR 1-Pentyl-3-phenylacetylindoles, a new class of cannabimimetic indoles. Bioorg Med Chem Lett15:4110-3 (2005) 
 
Cannabinoid receptor 1
Name:Cannabinoid receptor 1
Type:G Protein-Coupled Receptor (GPCR)
Mol. Mass.:52856.55
Organism:Rattus norvegicus (rat)
Description:P20272
Residue:473
BDBM50170357
NameBDBM50170357
Synonyms:2-(2-Chloro-phenyl)-1-(1-pentyl-1H-indol-3-yl)-ethanone CHEMBL189035 | JWH-203
TypeSmall organic molecule
Emp. Form.C21H22ClNO
Mol. Mass.339.858
SMILESCCCCCn1cc(C(=O)Cc2ccccc2Cl)c2ccccc12