Reaction Details
TargetMethionine aminopeptidase 1
LigandBDBM50170380
Substrate/Competitorn/a
Meas. Tech.ChEMBL_304990 (CHEMBL828603)
IC50 550±n/a nM
Citation Cui, YMHuang, QQXu, JChen, LLLi, JYYe, QZLi, JNan, FJ Identification of potent type I MetAPs inhibitors by simple bioisosteric replacement. Part 2: SAR studies of 5-heteroalkyl substituted TCAT derivatives. Bioorg Med Chem Lett15:4130-5 (2005) 
 
Methionine aminopeptidase 1
Name:Methionine aminopeptidase 1
Type:PROTEIN
Mol. Mass.:43382.92
Organism:Saccharomyces cerevisiae
Description:ChEMBL_10701
Residue:387
BDBM50170380
NameBDBM50170380
Synonyms:Benzyloxy-acetic acid 2-[4-(thiazol-2-ylcarbamoyl)-thiazol-5-yl]-ethyl ester | CHEMBL189127
TypeSmall organic molecule
Emp. Form.C18H17N3O4S2
Mol. Mass.403.475
SMILESO=C(COCc1ccccc1)OCCc1scnc1C(=O)Nc1nccs1