Reaction Details
TargetMethionine aminopeptidase 1
LigandBDBM50170388
Substrate/Competitorn/a
Meas. Tech.ChEMBL_304990 (CHEMBL828603)
IC50 450±n/a nM
Citation Cui, YMHuang, QQXu, JChen, LLLi, JYYe, QZLi, JNan, FJ Identification of potent type I MetAPs inhibitors by simple bioisosteric replacement. Part 2: SAR studies of 5-heteroalkyl substituted TCAT derivatives. Bioorg Med Chem Lett15:4130-5 (2005) 
 
Methionine aminopeptidase 1
Name:Methionine aminopeptidase 1
Type:PROTEIN
Mol. Mass.:43382.92
Organism:Saccharomyces cerevisiae
Description:ChEMBL_10701
Residue:387
BDBM50170388
NameBDBM50170388
Synonyms:5-((R)-2-Methoxy-2-phenyl-ethyl)-thiazole-4-carboxylic acid thiazol-2-ylamide | CHEMBL361480
TypeSmall organic molecule
Emp. Form.C16H15N3O2S2
Mol. Mass.345.439
SMILESCO[C@H](Cc1scnc1C(=O)Nc1nccs1)c1ccccc1