Reaction Details
TargetAndrogen receptor
LigandBDBM50170578
Substrate/Competitorn/a
Meas. Tech.ChEMBL_320884 (CHEMBL884809)
Ki 2900±n/a nM
Citation Hosoda, STanatani, AWakabayashi, KNakano, YMiyachi, HNagasawa, KHashimoto, Y Ligands with dual vitamin D3-agonistic and androgen-antagonistic activities. Bioorg Med Chem Lett15:4327-31 (2005) 
 
Androgen receptor
Name:Androgen receptor
Type:Receptor
Mol. Mass.:99185.27
Organism:Homo sapiens (Human)
Description:CHO cells were stably transfected with human AR gene.
Residue:920
BDBM50170578
NameBDBM50170578
Synonyms:1-(4-{1-Ethyl-1-[4-(3-hydroxy-3-methyl-butylamino)-3-methyl-phenyl]-propyl}-2-methyl-phenoxy)-3,3-dimethyl-butan-2-one | CHEMBL197548
TypeSmall organic molecule
Emp. Form.C30H45NO3
Mol. Mass.467.6832
SMILESCCC(CC)(c1ccc(NCCC(C)(C)O)c(C)c1)c1ccc(OCC(=O)C(C)(C)C)c(C)c1