Reaction Details
TargetAndrogen receptor
LigandBDBM50170573
Substrate/Competitorn/a
Meas. Tech.ChEMBL_322421 (CHEMBL873543)
IC50 9±n/a nM
Citation Hosoda, STanatani, AWakabayashi, KNakano, YMiyachi, HNagasawa, KHashimoto, Y Ligands with dual vitamin D3-agonistic and androgen-antagonistic activities. Bioorg Med Chem Lett15:4327-31 (2005) 
 
Androgen receptor
Name:Androgen receptor
Type:PROTEIN
Mol. Mass.:98196.62
Organism:Mus musculus
Description:ChEMBL_945930
Residue:899
BDBM50170573
NameBDBM50170573
Synonyms:3-(4-{1-Ethyl-1-[4-(2-hydroxy-3,3-dimethyl-butoxy)-3-methyl-phenyl]-propyl}-2-methyl-phenylamino)-propane-1,2-diol | CHEMBL370567
TypeSmall organic molecule
Emp. Form.C28H43NO4
Mol. Mass.457.6453
SMILESCCC(CC)(c1ccc(NCC(O)CO)c(C)c1)c1ccc(OCC(O)C(C)(C)C)c(C)c1