Reaction Details
TargetMelanin-concentrating hormone receptor 1
LigandBDBM50170618
Substrate/Competitorn/a
Meas. Tech.ChEMBL_302876 (CHEMBL828790)
Ki 6±n/a nM
Citation Palani, AShapiro, SMcBriar, MDClader, JWGreenlee, WJSpar, BKowalski, TJFarley, CCook, Jvan Heek, MWeig, BO'neill, KGraziano, MHawes, B Biaryl ureas as potent and orally efficacious melanin concentrating hormone receptor 1 antagonists for the treatment of obesity. J Med Chem48:4746-9 (2005) 
 
Melanin-concentrating hormone receptor 1
Name:Melanin-concentrating hormone receptor 1
Type:G Protein-Coupled Receptor (GPCR)
Mol. Mass.:45976.27
Organism:Homo sapiens (Human)
Description:Membranes from CHO-K1 cells stably expressing human MCH1R were used in assays.
Residue:422
BDBM50170618
NameBDBM50170618
Synonyms:1-(3'-Cyano-biphenyl-4-yl)-1-(2-dimethylamino-ethyl)-3-(3-fluoro-4-trifluoromethyl-phenyl)-urea | CHEMBL190401
TypeSmall organic molecule
Emp. Form.C25H22F4N4O
Mol. Mass.470.462
SMILESCN(C)CCN(C(=O)Nc1ccc(c(F)c1)C(F)(F)F)c1ccc(cc1)-c1cccc(c1)C#N