Reaction Details
TargetMelanin-concentrating hormone receptor 1
LigandBDBM50170622
Substrate/Competitorn/a
Meas. Tech.ChEMBL_302876 (CHEMBL828790)
Ki 3.3±n/a nM
Citation Palani, AShapiro, SMcBriar, MDClader, JWGreenlee, WJSpar, BKowalski, TJFarley, CCook, Jvan Heek, MWeig, BO'neill, KGraziano, MHawes, B Biaryl ureas as potent and orally efficacious melanin concentrating hormone receptor 1 antagonists for the treatment of obesity. J Med Chem48:4746-9 (2005) 
 
Melanin-concentrating hormone receptor 1
Name:Melanin-concentrating hormone receptor 1
Type:G Protein-Coupled Receptor (GPCR)
Mol. Mass.:45976.27
Organism:Homo sapiens (Human)
Description:Membranes from CHO-K1 cells stably expressing human MCH1R were used in assays.
Residue:422
BDBM50170622
NameBDBM50170622
Synonyms:3-(3-Chloro-4-fluoro-phenyl)-1-(3'-cyano-biphenyl-4-yl)-1-(2-dimethylamino-ethyl)-urea | CHEMBL189147
TypeSmall organic molecule
Emp. Form.C24H22ClFN4O
Mol. Mass.436.909
SMILESCN(C)CCN(C(=O)Nc1ccc(F)c(Cl)c1)c1ccc(cc1)-c1cccc(c1)C#N