Reaction Details
TargetMelanin-concentrating hormone receptor 1
LigandBDBM50170626
Substrate/Competitorn/a
Meas. Tech.ChEMBL_302876 (CHEMBL828790)
Ki 4±n/a nM
Citation Palani, AShapiro, SMcBriar, MDClader, JWGreenlee, WJSpar, BKowalski, TJFarley, CCook, Jvan Heek, MWeig, BO'neill, KGraziano, MHawes, B Biaryl ureas as potent and orally efficacious melanin concentrating hormone receptor 1 antagonists for the treatment of obesity. J Med Chem48:4746-9 (2005) 
 
Melanin-concentrating hormone receptor 1
Name:Melanin-concentrating hormone receptor 1
Type:G Protein-Coupled Receptor (GPCR)
Mol. Mass.:45976.27
Organism:Homo sapiens (Human)
Description:Membranes from CHO-K1 cells stably expressing human MCH1R were used in assays.
Residue:422
BDBM50170626
NameBDBM50170626
Synonyms:1-(3'-Cyano-biphenyl-4-yl)-1-(1-cyclopropylmethyl-piperidin-4-yl)-3-(4-fluoro-3-trifluoromethyl-phenyl)-urea | CHEMBL191409
TypeSmall organic molecule
Emp. Form.C30H28F4N4O
Mol. Mass.536.5631
SMILESFc1ccc(NC(=O)N(C2CCN(CC3CC3)CC2)c2ccc(cc2)-c2cccc(c2)C#N)cc1C(F)(F)F