Reaction Details
TargetAdenosine deaminase
LigandBDBM22947
Substrate/Competitorn/a
Meas. Tech.ChEMBL_304850 (CHEMBL828409)
IC50 6.7±n/a nM
Citation Terasaka, TTsuji, KKato, TNakanishi, IKinoshita, TKato, YKuno, MInoue, TTanaka, KNakamura, K Rational design of non-nucleoside, potent, and orally bioavailable adenosine deaminase inhibitors: predicting enzyme conformational change and metabolism. J Med Chem48:4750-3 (2005) 
 
Adenosine deaminase
Name:Adenosine deaminase
Type:Enzyme
Mol. Mass.:40759.44
Organism:Homo sapiens (Human)
Description:Human recombinant ADA was expressed and purified from an ADA-deficient bacterial strain.
Residue:363
BDBM22947
NameBDBM22947
Synonyms:1-[(2R)-4-{5-[3-(4-chlorophenyl)propoxy]-1-methyl-1H-indol-3-yl}-1-hydroxybutan-2-yl]-1H-imidazole-4-carboxamide Hybrid compound 1(FR235999) derivative, 8c
TypeSmall organic molecule
Emp. Form.C26H29ClN4O3
Mol. Mass.480.986
SMILESCn1cc(CC[C@H](CO)n2cnc(c2)C(N)=O)c2cc(OCCCc3ccc(Cl)cc3)ccc12