Reaction Details
TargetDelta-type opioid receptor
LigandBDBM50170679
Substrate/Competitorn/a
Meas. Tech.ChEMBL_302815 (CHEMBL839505)
Ki 6470±n/a nM
Citation Harding, WWTidgewell, KByrd, NCobb, HDersch, CMButelman, ERRothman, RBPrisinzano, TE Neoclerodane diterpenes as a novel scaffold for mu opioid receptor ligands. J Med Chem48:4765-71 (2005) 
 
Delta-type opioid receptor
Name:Delta-type opioid receptor
Type:G Protein-Coupled Receptor (GPCR)
Mol. Mass.:40382.98
Organism:Homo sapiens (Human)
Description:Competition binding assays were carried out using membrane preparations from transfected HN9.10 cells that constitutively expressed the delta opioid receptor.
Residue:372
BDBM50170679
NameBDBM50170679
Synonyms:(3S,4aR,4bS,6S,8R,8aR,10aR)-3-Furan-3-yl-4a,8a-dimethyl-1,5-dioxo-6-(2,2,2-trichloro-acetimidoyloxy)-dodecahydro-2-oxa-phenanthrene-8-carboxylic acid methyl ester | CHEMBL190902
TypeSmall organic molecule
Emp. Form.C23H26Cl3NO7
Mol. Mass.534.814
SMILESCOC(=O)[C@@H]1C[C@H](OC(=N)C(Cl)(Cl)Cl)C(=O)[C@H]2[C@@]1(C)CC[C@H]1C(=O)O[C@@H](C[C@]21C)c1ccoc1