Reaction Details
TargetDelta-type opioid receptor
LigandBDBM50170675
Substrate/Competitorn/a
Meas. Tech.ChEMBL_302815 (CHEMBL839505)
Ki>10000±n/a nM
Citation Harding, WWTidgewell, KByrd, NCobb, HDersch, CMButelman, ERRothman, RBPrisinzano, TE Neoclerodane diterpenes as a novel scaffold for mu opioid receptor ligands. J Med Chem48:4765-71 (2005) 
 
Delta-type opioid receptor
Name:Delta-type opioid receptor
Type:G Protein-Coupled Receptor (GPCR)
Mol. Mass.:40382.98
Organism:Homo sapiens (Human)
Description:Competition binding assays were carried out using membrane preparations from transfected HN9.10 cells that constitutively expressed the delta opioid receptor.
Residue:372
BDBM50170675
NameBDBM50170675
Synonyms:(3S,4aR,4bS,5R,6S,8R,8aR,10aS)-3-Furan-3-yl-5,6-dihydroxy-4a,8a-dimethyl-1-oxo-dodecahydro-2-oxa-phenanthrene-8-carboxylic acid methyl ester | CHEMBL188791
TypeSmall organic molecule
Emp. Form.C21H28O7
Mol. Mass.392.4428
SMILESCOC(=O)[C@@H]1C[C@H](O)[C@H](O)[C@H]2[C@@]1(C)CC[C@@H]1C(=O)O[C@@H](C[C@]21C)c1ccoc1