Reaction Details
TargetMu-type opioid receptor
LigandBDBM50170669
Substrate/Competitorn/a
Meas. Tech.ChEMBL_304303 (CHEMBL830098)
EC50 590±n/a nM
Citation Harding, WWTidgewell, KByrd, NCobb, HDersch, CMButelman, ERRothman, RBPrisinzano, TE Neoclerodane diterpenes as a novel scaffold for mu opioid receptor ligands. J Med Chem48:4765-71 (2005) 
 
Mu-type opioid receptor
Name:Mu-type opioid receptor
Type:G Protein-Coupled Receptor (GPCR)
Mol. Mass.:44789.51
Organism:Homo sapiens (Human)
Description:P35372
Residue:400
BDBM50170669
NameBDBM50170669
Synonyms:(3S,4aR,4bS,6S,8R,8aR,10aR)-3-Furan-3-yl-4a,8a-dimethyl-1,5-dioxo-6-phenylcarbamoyloxy-dodecahydro-2-oxa-phenanthrene-8-carboxylic acid methyl ester | CHEMBL190785
TypeSmall organic molecule
Emp. Form.C28H31NO8
Mol. Mass.509.5476
SMILESCOC(=O)[C@@H]1C[C@H](OC(=O)Nc2ccccc2)C(=O)[C@H]2[C@@]1(C)CC[C@H]1C(=O)O[C@@H](C[C@]21C)c1ccoc1