Reaction Details
TargetKappa-type opioid receptor
LigandBDBM50170673
Substrate/Competitorn/a
Meas. Tech.ChEMBL_302816 (CHEMBL839506)
Ki 19±n/a nM
Citation Harding, WWTidgewell, KByrd, NCobb, HDersch, CMButelman, ERRothman, RBPrisinzano, TE Neoclerodane diterpenes as a novel scaffold for mu opioid receptor ligands. J Med Chem48:4765-71 (2005) 
 
Kappa-type opioid receptor
Name:Kappa-type opioid receptor
Type:G Protein-Coupled Receptor (GPCR)
Mol. Mass.:42648.76
Organism:Homo sapiens (Human)
Description:P41145
Residue:380
BDBM50170673
NameBDBM50170673
Synonyms:(3S,4aR,4bS,6S,8R,8aR,10aR)-3-Furan-3-yl-6-isobutyryloxy-4a,8a-dimethyl-1,5-dioxo-dodecahydro-2-oxa-phenanthrene-8-carboxylic acid methyl ester | CHEMBL188553
TypeSmall organic molecule
Emp. Form.C25H32O8
Mol. Mass.460.5168
SMILESCOC(=O)[C@@H]1C[C@H](OC(=O)C(C)C)C(=O)[C@H]2[C@@]1(C)CC[C@H]1C(=O)O[C@@H](C[C@]21C)c1ccoc1